Target
Tyrosine-protein kinase JAK3
Ligand
BDBM50339006
Substrate
Meas. Tech.
ChEMBL_729508 (CHEMBL1696434)
IC50
990±n/a nM
Citation
 Medina, JRBlackledge, CWHeerding, DACampobasso, NWard, PBriand, JWright, LAxten, JM. Aminoindazole PDK1 Inhibitors: A Case Study in Fragment-Based Drug Discovery. ACS Med Chem Lett 1:439-442 (2010)  
Target
Name:
Tyrosine-protein kinase JAK3
Synonyms:
JAK-3 JAK3_HUMAN Janus kinase 3 (JAK3) L-JAK | Leukocyte janus kinase
Type:
Protein
Mol. Mass.:
125111.08
Organism:
Homo sapiens (Human)
Description:
P52333
Residue:
1124
  
Inhibitor
Name:
BDBM50339006
Synonyms:
6-(2-Amino-4-pyrimidinyl)-1H-indazol-3-amine CHEMBL1688215
Type:
Small organic molecule
Emp. Form.:
C11H10N6
Mol. Mass.:
226.2373
SMILES:
Nc1n[nH]c2cc(ccc12)-c1ccnc(N)n1
: