Target
Metabotropic glutamate receptor 5
Ligand
BDBM50339069
Substrate
Meas. Tech.
ChEMBL_730110 (CHEMBL1695876)
EC50
>10000±n/a nM
Citation
 Zhou, YManka, JTRodriguez, ALWeaver, CDDays, ELVinson, PNJadhav, SHermann, EJJones, CKConn, PJLindsley, CWStauffer, SR Discovery of N-Aryl Piperazines as Selective mGlu(5) Potentiators with Efficacy in a Rodent Model Predictive of Anti-Psychotic Activity. ACS Med Chem Lett 1:433-438 (2010)  
Target
Name:
Metabotropic glutamate receptor 5
Synonyms:
GRM5_RAT Grm5 Mglur5 metabotropic glutamate 5/1-C metabotropic glutamate 5a
Type:
Enzyme
Mol. Mass.:
131900.14
Organism:
Rattus norvegicus (Rat)
Description:
P31424
Residue:
1203
  
Inhibitor
Name:
BDBM50339069
Synonyms:
CHEMBL1688373 | methyl 2-(4-(2-(benzyloxy)acetyl)piperazin-1-yl)benzoate
Type:
Small organic molecule
Emp. Form.:
C21H24N2O4
Mol. Mass.:
368.4263
SMILES:
COC(=O)c1ccccc1N1CCN(CC1)C(=O)COCc1ccccc1
: