Target
Broad substrate specificity ATP-binding cassette transporter ABCG2
Ligand
BDBM50339151
Substrate
Meas. Tech.
ChEMBL_735838 (CHEMBL1694230)
IC50
6600±n/a nM
Citation
 Versiani, MADiyabalanage, TRatnayake, RHenrich, CJBates, SEMcMahon, JBGustafson, KR Flavonoids from eight tropical plant species that inhibit the multidrug resistance transporter ABCG2. J Nat Prod 74:262-6 (2011)  
Target
Name:
Broad substrate specificity ATP-binding cassette transporter ABCG2
Synonyms:
ABCG2 ABCP ATP-binding cassette sub-family G member 2 ATP-binding cassette, sub-family G, member 2 BCRP1 CDw338 Mitoxantrone resistance-associated protein Urate exporter
Type:
Multi-pass membrane protein; monomer or homodimer; disulfide-linked
Mol. Mass.:
72329.48
Organism:
Homo sapiens (Human)
Description:
Q9UNQ0
Residue:
655
  
Inhibitor
Name:
BDBM50339151
Synonyms:
(2S)-5,7,3'-trihydroxy-4'-methoxy-8-(3''-methylbut-2''-enyl)-flavonone | CHEMBL1689340
Type:
Small organic molecule
Emp. Form.:
C21H22O6
Mol. Mass.:
370.3958
SMILES:
[#6]-[#8]-c1ccc(cc1-[#8])-[#6@@H]-1-[#6]-[#6](=O)-c2c(-[#8])cc(-[#8])c(-[#6]\[#6]=[#6](\[#6])-[#6])c2-[#8]-1
: