Target
Falcipain-2
Ligand
BDBM50339258
Substrate
Meas. Tech.
ChEMBL_736241 (CHEMBL1693385)
IC50
>50000±n/a nM
Citation
 Praveen Kumar, SGut, JGuedes, RCRosenthal, PJSantos, MMMoreira, R Design, synthesis and evaluation of 3-methylene-substituted indolinones as antimalarials. Eur J Med Chem 46:927-33 (2011)  
Target
Name:
Falcipain-2
Synonyms:
Type:
Enzyme
Mol. Mass.:
55912.57
Organism:
Plasmodium falciparum
Description:
Residue:
484
  
Inhibitor
Name:
BDBM50339258
Synonyms:
(Z/E)-7-chloro-3-((dimethylamino)methylene)indolin-2-one | CHEMBL1689598
Type:
Small organic molecule
Emp. Form.:
C11H11ClN2O
Mol. Mass.:
222.671
SMILES:
CN(C)C=C1C(=O)Nc2c1cccc2Cl
: