Target
Falcipain-2
Ligand
BDBM50339268
Substrate
Meas. Tech.
ChEMBL_736241 (CHEMBL1693385)
IC50
>50000±n/a nM
Citation
 Praveen Kumar, SGut, JGuedes, RCRosenthal, PJSantos, MMMoreira, R Design, synthesis and evaluation of 3-methylene-substituted indolinones as antimalarials. Eur J Med Chem 46:927-33 (2011)  
Target
Name:
Falcipain-2
Synonyms:
Type:
Enzyme
Mol. Mass.:
55912.57
Organism:
Plasmodium falciparum
Description:
Residue:
484
  
Inhibitor
Name:
BDBM50339268
Synonyms:
(Z/E)-5-chloro-3-((3-(7-chloroquinolin-4-ylamino)propylamino)methylene)indolin-2-one | CHEMBL1689612
Type:
Small organic molecule
Emp. Form.:
C21H18Cl2N4O
Mol. Mass.:
413.3
SMILES:
Clc1ccc2NC(=O)C(C=NCCCNc3ccnc4cc(Cl)ccc34)c2c1
: