Target
Cysteine proteinase falcipain 3
Ligand
BDBM50339264
Substrate
Meas. Tech.
ChEMBL_736242 (CHEMBL1693386)
IC50
>50000±n/a nM
Citation
 Praveen Kumar, SGut, JGuedes, RCRosenthal, PJSantos, MMMoreira, R Design, synthesis and evaluation of 3-methylene-substituted indolinones as antimalarials. Eur J Med Chem 46:927-33 (2011)  
Target
Name:
Cysteine proteinase falcipain 3
Synonyms:
Cysteine protease falcipain-3
Type:
Protein
Mol. Mass.:
56666.98
Organism:
Plasmodium falciparum
Description:
Q9NAW4
Residue:
492
  
Inhibitor
Name:
BDBM50339264
Synonyms:
(Z/E)-(S)-N-isopentyl-4-methyl-2-((2-oxoindolin-3-ylidene)methylamino)pentanamide | CHEMBL1689603
Type:
Small organic molecule
Emp. Form.:
C20H29N3O2
Mol. Mass.:
343.4632
SMILES:
CC(C)CCNC(=O)[C@H](CC(C)C)N=CC1C(=O)Nc2ccccc12
: