Target
Adenosine kinase
Ligand
BDBM50339509
Substrate
Meas. Tech.
ChEMBL_736608 (CHEMBL1694989)
IC50
2200±n/a nM
Citation
 Butini, SGemma, SBrindisi, MBorrelli, GLossani, APonte, AMTorti, AMaga, GMarinelli, LLa Pietra, VFiorini, ILamponi, SCampiani, GZisterer, DMNathwani, SMSartini, SLa Motta, CDa Settimo, FNovellino, EFocher, F Non-nucleoside inhibitors of human adenosine kinase: synthesis, molecular modeling, and biological studies. J Med Chem 54:1401-20 (2011)  
Target
Name:
Adenosine kinase
Synonyms:
ADK | ADK_HUMAN
Type:
PROTEIN
Mol. Mass.:
40545.97
Organism:
Homo sapiens (Human)
Description:
ChEMBL_1467841
Residue:
362
  
Inhibitor
Name:
BDBM50339509
Synonyms:
(+/-)-6-Ethyl-6-[4-[(4-iodophenylthio)methyl]phenyl]-6,7-dihydrobenzo[b]pyrrolo[1,2-d][1,4]thiazepin-7-one | CHEMBL1687952
Type:
Small organic molecule
Emp. Form.:
C27H22INOS2
Mol. Mass.:
567.504
SMILES:
CCC1(Sc2ccccc2-n2cccc2C1=O)c1ccc(CSc2ccc(I)cc2)cc1
: