Target
Extracellular calcium-sensing receptor
Ligand
BDBM50339725
Substrate
Meas. Tech.
ChEMBL_735492 (CHEMBL1692876)
IC50
0.94±n/a nM
Citation
 Yoshida, MMori, AMorimoto, SKotani, EOka, MNotoya, KMakino, HOno, MShirasaki, MTada, NFujita, HBan, JIkeda, YKawamoto, TGoto, MKimura, HBaba, AYasuma, T Novel and potent calcium-sensing receptor antagonists: discovery of (5R)-N-[1-ethyl-1-(4-ethylphenyl)propyl]-2,7,7-trimethyl-5-phenyl-4,5,6,7-tetrahydropyrazolo[1,5-a]pyrimidine-3-carboxamide monotosylate (TAK-075) as an orally active bone anabolic agent. Bioorg Med Chem 19:1881-94 (2011)  
Target
Name:
Extracellular calcium-sensing receptor
Synonyms:
CASR CaR Calcium-sensing receptor (CaSR) GPRC2A Parathyroid Cell calcium-sensing receptor Synonyms=GPRC2A | hCasR
Type:
Protein
Mol. Mass.:
120663.13
Organism:
Homo sapiens (Human)
Description:
P41180
Residue:
1078
  
Inhibitor
Name:
BDBM50339725
Synonyms:
(5R)-N-[1-Ethyl-1-(4-ethylphenyl)propyl]-2,7,7-trimethyl-5-phenyl-4,5,6,7-tetrahydropyrazolo[1,5-a]pyrimidine-3-carboxamide p-toluenesulfonate CHEMBL1689060
Type:
Small organic molecule
Emp. Form.:
C29H38N4O
Mol. Mass.:
458.6382
SMILES:
CCc1ccc(cc1)C(CC)(CC)NC(=O)c1c(C)nn2c1N[C@H](CC2(C)C)c1ccccc1
: