Target
Bcl-2-like protein 2
Ligand
BDBM21447
Substrate
Meas. Tech.
ChEMBL_735551 (CHEMBL1693159)
IC50
40±n/a nM
Citation
 Sleebs, BECzabotar, PEFairbrother, WJFairlie, WDFlygare, JAHuang, DCKersten, WJKoehler, MFLessene, GLowes, KParisot, JPSmith, BJSmith, MLSouers, AJStreet, IPYang, HBaell, JB Quinazoline sulfonamides as dual binders of the proteins B-cell lymphoma 2 and B-cell lymphoma extra long with potent proapoptotic cell-based activity. J Med Chem 54:1914-26 (2011)  
Target
Name:
Bcl-2-like protein 2
Synonyms:
Apoptosis regulator Bcl-W BCL-W BCLW Bcl2-L-2 | KIAA0271
Type:
Protein
Mol. Mass.:
20742.61
Organism:
Homo sapiens (Human)
Description:
Residue:
193
  
Inhibitor
Name:
BDBM21447
Synonyms:
4-(4-{[2-(4-chlorophenyl)phenyl]methyl}piperazin-1-yl)-N-[(4-{[(2R)-4-(dimethylamino)-1-(phenylsulfanyl)butan-2-yl]amino}-3-nitrobenzene)sulfonyl]benzamide CHEMBL376408 US11760752, Compound ABT-737 | US9125913, ABT-737
Type:
Small organic molecule
Emp. Form.:
C42H45ClN6O5S2
Mol. Mass.:
813.427
SMILES:
CN(C)CC[C@H](CSc1ccccc1)Nc1ccc(cc1[N+]([O-])=O)S(=O)(=O)NC(=O)c1ccc(cc1)N1CCN(Cc2ccccc2-c2ccc(Cl)cc2)CC1
: