Target
11-beta-hydroxysteroid dehydrogenase type 2
Ligand
BDBM50339811
Substrate
Meas. Tech.
ChEMBL_735656 (CHEMBL1693471)
IC50
15±n/a nM
Citation
 Gaware, RKhunt, RCzollner, LStanetty, CDa Cunha, TKratschmar, DVOdermatt, AKosma, PJordis, UClassen-Houben, D Synthesis of new glycyrrhetinic acid derived ring A azepanone, 29-urea and 29-hydroxamic acid derivatives as selective 11ß-hydroxysteroid dehydrogenase 2 inhibitors. Bioorg Med Chem 19:1866-80 (2011)  
Target
Name:
11-beta-hydroxysteroid dehydrogenase type 2
Synonyms:
11-DH2 11-beta-Hydroxysteroid Dehydrogenase 2 (11-beta-HSD2) 11-beta-hydroxysteroid dehydrogenase 2 11-beta-hydroxysteroid dehydrogenase type 2 (11-beta-HSD2) DHI2_HUMAN HSD11K SDR9C3
Type:
Enzyme
Mol. Mass.:
44141.72
Organism:
Homo sapiens (Human)
Description:
Purified recombinant human 11beta-HSD2.
Residue:
405
  
Inhibitor
Name:
BDBM50339811
Synonyms:
(3beta,18beta,20beta)-N-Hydroxy-N-methyl-[3-(1,2,4-oxadiazole-5(2H)-one)]-11-oxo-olean-12-en-29-amide | CHEMBL1689282
Type:
Small organic molecule
Emp. Form.:
C33H49N3O6
Mol. Mass.:
583.7587
SMILES:
CN(O)C(=O)[C@@]1(C)CC[C@]2(C)CC[C@]3(C)C(=CC(=O)[C@@H]4[C@@]5(C)CC[C@H](Oc6nc(=O)o[nH]6)C(C)(C)[C@@H]5CC[C@@]34C)[C@@H]2C1
: