Target
Beta-lactamase
Ligand
BDBM50339852
Substrate
Meas. Tech.
ChEMBL_740684 (CHEMBL1763746)
Ki
63220±n/a nM
Citation
 Xia, YCao, KZhou, YAlley, MRRock, FMohan, MMeewan, MBaker, SJLux, SDing, CZJia, GKully, MPlattner, JJ Synthesis and SAR of novel benzoxaboroles as a new class of β-lactamase inhibitors. Bioorg Med Chem Lett 21:2533-6 (2011)  
Target
Name:
Beta-lactamase
Synonyms:
AMPC_ENTCL | ampC
Type:
PROTEIN
Mol. Mass.:
41306.67
Organism:
Enterobacter cloacae
Description:
ChEMBL_40258
Residue:
381
  
Inhibitor
Name:
BDBM50339852
Synonyms:
6-(phenylsulfonyl)benzo[c][1,2]oxaborol-1(3H)-ol | CHEMBL1761257
Type:
Small organic molecule
Emp. Form.:
C13H11BO4S
Mol. Mass.:
274.1
SMILES:
OB1OCc2ccc(cc12)S(=O)(=O)c1ccccc1
: