Target
Beta-lactamase
Ligand
BDBM50339853
Substrate
Meas. Tech.
ChEMBL_740684 (CHEMBL1763746)
Ki
46560±n/a nM
Citation
 Xia, YCao, KZhou, YAlley, MRRock, FMohan, MMeewan, MBaker, SJLux, SDing, CZJia, GKully, MPlattner, JJ Synthesis and SAR of novel benzoxaboroles as a new class of β-lactamase inhibitors. Bioorg Med Chem Lett 21:2533-6 (2011)  
Target
Name:
Beta-lactamase
Synonyms:
AMPC_ENTCL | ampC
Type:
PROTEIN
Mol. Mass.:
41306.67
Organism:
Enterobacter cloacae
Description:
ChEMBL_40258
Residue:
381
  
Inhibitor
Name:
BDBM50339853
Synonyms:
CHEMBL1761258 | N-(1-hydroxy-1,3-dihydrobenzo[c][1,2]oxaborol-6-yl)benzamide
Type:
Small organic molecule
Emp. Form.:
C14H12BNO3
Mol. Mass.:
253.061
SMILES:
OB1OCc2ccc(NC(=O)c3ccccc3)cc12
: