Target
Acetylcholinesterase
Ligand
BDBM50119787
Substrate
Meas. Tech.
ChEMBL_739672 (CHEMBL1763498)
IC50
80±n/a nM
Citation
 Komloova, MMusilek, KHorova, AHolas, ODohnal, VGunn-Moore, FKuca, K Preparation, in vitro screening and molecular modelling of symmetrical bis-quinolinium cholinesterase inhibitors--implications for early myasthenia gravis treatment. Bioorg Med Chem Lett 21:2505-9 (2011)  
Target
Name:
Acetylcholinesterase
Synonyms:
ACES_HUMAN Acetylcholinesterase (AChE) | Acetylcholinesterase (human AChE)
Type:
Enzyme
Mol. Mass.:
67792.70
Organism:
Homo sapiens (Human)
Description:
P22303
Residue:
614
  
Inhibitor
Name:
BDBM50119787
Synonyms:
1,1''-(octane-1,8-diyl)diquinolinium iodide CHEMBL1761995 | CHEMBL276745
Type:
Small organic molecule
Emp. Form.:
C26H30N2
Mol. Mass.:
370.5287
SMILES:
C(CCCC[n+]1cccc2ccccc12)CCC[n+]1cccc2ccccc12
: