Target
Cholinesterase
Ligand
BDBM50119796
Substrate
Meas. Tech.
ChEMBL_739674 (CHEMBL1763500)
IC50
5000±n/a nM
Citation
 Komloova, MMusilek, KHorova, AHolas, ODohnal, VGunn-Moore, FKuca, K Preparation, in vitro screening and molecular modelling of symmetrical bis-quinolinium cholinesterase inhibitors--implications for early myasthenia gravis treatment. Bioorg Med Chem Lett 21:2505-9 (2011)  
Target
Name:
Cholinesterase
Synonyms:
Acylcholine acylhydrolase Butyrylcholine esterase (BChE) Butyrylcholinesterase (BuChE) CHLE_HUMAN Cholinesterases Pseudocholinesterase
Type:
Homotetramer
Mol. Mass.:
68422.27
Organism:
Homo sapiens (Human)
Description:
P06276
Residue:
602
  
Inhibitor
Name:
BDBM50119796
Synonyms:
1,1'-(hexane-1,6-diyl)diquinolinium iodide CHEMBL430870 | CHEMBL601410
Type:
Small organic molecule
Emp. Form.:
C24H26N2
Mol. Mass.:
342.4755
SMILES:
C(CCC[n+]1cccc2ccccc12)CC[n+]1cccc2ccccc12
: