Target
Cholinesterase
Ligand
BDBM50119787
Substrate
Meas. Tech.
ChEMBL_739674 (CHEMBL1763500)
IC50
700±n/a nM
Citation
 Komloova, MMusilek, KHorova, AHolas, ODohnal, VGunn-Moore, FKuca, K Preparation, in vitro screening and molecular modelling of symmetrical bis-quinolinium cholinesterase inhibitors--implications for early myasthenia gravis treatment. Bioorg Med Chem Lett 21:2505-9 (2011)  
Target
Name:
Cholinesterase
Synonyms:
Acylcholine acylhydrolase Butyrylcholine esterase (BChE) Butyrylcholinesterase (BuChE) CHLE_HUMAN Cholinesterases Pseudocholinesterase
Type:
Homotetramer
Mol. Mass.:
68422.27
Organism:
Homo sapiens (Human)
Description:
P06276
Residue:
602
  
Inhibitor
Name:
BDBM50119787
Synonyms:
1,1''-(octane-1,8-diyl)diquinolinium iodide CHEMBL1761995 | CHEMBL276745
Type:
Small organic molecule
Emp. Form.:
C26H30N2
Mol. Mass.:
370.5287
SMILES:
C(CCCC[n+]1cccc2ccccc12)CCC[n+]1cccc2ccccc12
: