Target
Cholinesterase
Ligand
BDBM120262
Substrate
Meas. Tech.
ChEMBL_739674 (CHEMBL1763500)
IC50
1370000±n/a nM
Citation
 Komloova, MMusilek, KHorova, AHolas, ODohnal, VGunn-Moore, FKuca, K Preparation, in vitro screening and molecular modelling of symmetrical bis-quinolinium cholinesterase inhibitors--implications for early myasthenia gravis treatment. Bioorg Med Chem Lett 21:2505-9 (2011)  
Target
Name:
Cholinesterase
Synonyms:
Acylcholine acylhydrolase Butyrylcholine esterase (BChE) Butyrylcholinesterase (BuChE) CHLE_HUMAN Cholinesterases Pseudocholinesterase
Type:
Homotetramer
Mol. Mass.:
68422.27
Organism:
Homo sapiens (Human)
Description:
P06276
Residue:
602
  
Inhibitor
Name:
BDBM120262
Synonyms:
EDROPHONIUM BROMIDE Edrophonium cid_8307
Type:
Small organic molecule
Emp. Form.:
C10H16NO
Mol. Mass.:
166.2396
SMILES:
CC[N+](C)(C)c1cccc(O)c1
: