Target
Melatonin receptor type 1A
Ligand
BDBM50340329
Substrate
Meas. Tech.
ChEMBL_740913 (CHEMBL1764014)
EC50
12±n/a nM
Citation
 Jeanty, MSuzenet, FDelagrange, PNosjean, OBoutin, JACaignard, DHGuillaumet, G Design and synthesis of 1-(2-alkanamidoethyl)-6-methoxy-7-azaindole derivatives as potent melatonin agonists. Bioorg Med Chem Lett 21:2316-9 (2011)  
Target
Name:
Melatonin receptor type 1A
Synonyms:
MTNR1A MTR1A_HUMAN Mel1a melatonin receptor Melatonin receptor Melatonin receptor type 1 (MT1) | Melatonin receptor type 1A
Type:
Enzyme
Mol. Mass.:
39392.94
Organism:
Homo sapiens (Human)
Description:
P48039
Residue:
350
  
Inhibitor
Name:
BDBM50340329
Synonyms:
4-azamelatonin | CHEMBL1760944
Type:
Small organic molecule
Emp. Form.:
C12H15N3O2
Mol. Mass.:
233.2664
SMILES:
COc1ccc2[nH]cc(CCNC(C)=O)c2n1
: