Target
Renin
Ligand
BDBM50340410
Substrate
Meas. Tech.
ChEMBL_741046 (CHEMBL1764274)
pH
7.4±n/a
IC50
0.022±n/a nM
Comments
extracted
Citation
 Aspiotis, RChen, ACauchon, EDubé, DFalgueyret, JPGagné, SGallant, MGrimm, ELHoule, RJuteau, HLacombe, PLaliberté, SLévesque, JFMacDonald, DMcKay, DPercival, MDRoy, PSoisson, SMWu, T The discovery and synthesis of potent zwitterionic inhibitors of renin. Bioorg Med Chem Lett 21:2430-6 (2011)  
Target
Name:
Renin
Synonyms:
Angiotensinogenase RENI_HUMAN
Type:
Enzyme
Mol. Mass.:
45058.99
Organism:
Homo sapiens (Human)
Description:
Residue:
406
  
Inhibitor
Name:
BDBM50340410
Synonyms:
(3R,4S)-N-cyclopropyl-4-(4-(2-(2,6-dichloro-4-methylphenoxy)ethoxy)phenyl)-N-(3-(3-(3-ethylureido)propoxy)-5-(3-methoxypropyl)benzyl)piperidine-3-carboxamide | CHEMBL1761522
Type:
Small organic molecule
Emp. Form.:
C41H54Cl2N4O6
Mol. Mass.:
769.797
SMILES:
CCNC(=O)NCCCOc1cc(CCCOC)cc(CN(C2CC2)C(=O)[C@H]2CNCC[C@@H]2c2ccc(OCCOc3c(Cl)cc(C)cc3Cl)cc2)c1
: