Target
Caspase-3
Ligand
BDBM50340533
Substrate
Meas. Tech.
ChEMBL_741338 (CHEMBL1764807)
IC50
3.1±n/a nM
Citation
 Chu, WRothfuss, JZhou, DMach, RH Synthesis and evaluation of isatin analogs as caspase-3 inhibitors: introduction of a hydrophilic group increases potency in a whole cell assay. Bioorg Med Chem Lett 21:2192-7 (2011)  
Target
Name:
Caspase-3
Synonyms:
Apopain CASP3 CPP-32 Caspase 3 Caspase-3 subunit p17 SCA-1 Yama protein | caspase-3 preproprotein
Type:
Hydrolase; heterotetramer of two heterodimers
Mol. Mass.:
31607.55
Organism:
Homo sapiens (Human)
Description:
Residue:
277
  
Inhibitor
Name:
BDBM50340533
Synonyms:
(S)-1-(4-(2-fluoroethoxy)benzyl)-5-(2-((pyridin-3-yloxy)methyl)pyrrolidin-1-ylsulfonyl)indoline-2,3-dione | CHEMBL1762353
Type:
Small organic molecule
Emp. Form.:
C27H26FN3O6S
Mol. Mass.:
539.575
SMILES:
FCCOc1ccc(CN2C(=O)C(=O)c3cc(ccc23)S(=O)(=O)N2CCC[C@H]2COc2cccnc2)cc1
: