Target
Caspase-6
Ligand
BDBM50340548
Substrate
Meas. Tech.
ChEMBL_741340 (CHEMBL1764809)
IC50
8±n/a nM
Citation
 Chu, WRothfuss, JZhou, DMach, RH Synthesis and evaluation of isatin analogs as caspase-3 inhibitors: introduction of a hydrophilic group increases potency in a whole cell assay. Bioorg Med Chem Lett 21:2192-7 (2011)  
Target
Name:
Caspase-6
Synonyms:
Apoptotic protease Mch-2 CASP6 Caspase | MCH2
Type:
Enzyme
Mol. Mass.:
33312.62
Organism:
Homo sapiens (Human)
Description:
P55212
Residue:
293
  
Inhibitor
Name:
BDBM50340548
Synonyms:
(4S,7S,10S,13S)-10-sec-butyl-7-(2-carboxyethyl)-13-formyl-4-isopropyl-2,5,8,11-tetraoxo-3,6,9,12-tetraazapentadecan-15-oic acid CHEMBL478081
Type:
Small organic molecule
Emp. Form.:
C22H36N4O9
Mol. Mass.:
500.5426
SMILES:
CC[C@H](C)[C@H](NC(=O)[C@H](CCC(O)=O)NC(=O)[C@@H](NC(C)=O)C(C)C)C(=O)N[C@@H](CC(O)=O)C=O
: