Target
Ephrin type-B receptor 4
Ligand
BDBM50340562
Substrate
Meas. Tech.
ChEMBL_741347 (CHEMBL1764816)
IC50
4±n/a nM
Citation
 Barlaam, BDucray, RLambert-van der Brempt, CPlé, PBardelle, CBrooks, NColeman, TCross, DKettle, JGRead, J Inhibitors of the tyrosine kinase EphB4. Part 4: Discovery and optimization of a benzylic alcohol series. Bioorg Med Chem Lett 21:2207-11 (2011)  
Target
Name:
Ephrin type-B receptor 4
Synonyms:
EPHB4 Ephrin receptor HTK MYK1 Tyrosine-protein kinase TYRO11 | VHL/Ephrin type-B receptor 4
Type:
Enzyme
Mol. Mass.:
108273.51
Organism:
Homo sapiens (Human)
Description:
P54760
Residue:
987
  
Inhibitor
Name:
BDBM50340562
Synonyms:
(4-methyl-3-(methyl(2-(3-(4-methylpiperazin-1-yl)-5-morpholinophenylamino)pyrimidin-4-yl)amino)phenyl)methanol | CHEMBL1762539
Type:
Small organic molecule
Emp. Form.:
C28H37N7O2
Mol. Mass.:
503.6391
SMILES:
CN(c1ccnc(Nc2cc(cc(c2)N2CCN(C)CC2)N2CCOCC2)n1)c1cc(CO)ccc1C
: