Target
Beta-secretase 1
Ligand
BDBM50340596
Substrate
Meas. Tech.
ChEMBL_741437 (CHEMBL1763696)
IC50
20010±n/a nM
Citation
 Ortega, ARincón, AJiménez-Aliaga, KLBermejo-Bescós, PMartín-Aragón, SMolina, MTCsákÿ, AG Synthesis and evaluation of arylquinones as BACE1 inhibitors,β-amyloid peptide aggregation inhibitors, and destabilizers of preformed β-amyloid fibrils. Bioorg Med Chem Lett 21:2183-7 (2011)  
Target
Name:
Beta-secretase 1
Synonyms:
ASP2 Aspartyl protease 2 BACE1 Beta-secretase (BACE) Beta-secretase 1 (BACE 1) Beta-secretase 1 (BACE1) Beta-site amyloid precursor protein cleaving enzyme 1 Memapsin-2 beta-Secretase (BACE-1) | beta-Secretase (BACE1)
Type:
Protein
Mol. Mass.:
55755.10
Organism:
Homo sapiens (Human)
Description:
P56817
Residue:
501
  
Inhibitor
Name:
BDBM50340596
Synonyms:
Acetic acid 5'-acetoxy-4,4'-[1,1';3',1'']terphenyl-2'-yl ester | CHEMBL1762687
Type:
Small organic molecule
Emp. Form.:
C22H18O4
Mol. Mass.:
346.3759
SMILES:
CC(=O)Oc1cc(c(OC(C)=O)c(c1)-c1ccccc1)-c1ccccc1
: