Target
Lethal factor
Ligand
BDBM50340763
Substrate
Meas. Tech.
ChEMBL_740261 (CHEMBL1764161)
Ki
0.81±n/a nM
Citation
 Kim, SJiao, GSMoayeri, MCrown, DCregar-Hernandez, LMcKasson, LMargosiak, SALeppla, SHJohnson, AT Antidotes to anthrax lethal factor intoxication. Part 2: structural modifications leading to improved in vivo efficacy. Bioorg Med Chem Lett 21:2030-3 (2011)  
Target
Name:
Lethal factor
Synonyms:
Anthrax Lethal Factor (LF) Antrax lethal toxin lef | lethal factor
Type:
PROTEIN
Mol. Mass.:
93758.56
Organism:
Bacillus anthracis
Description:
ChEMBL_1460338
Residue:
809
  
Inhibitor
Name:
BDBM50340763
Synonyms:
(R)-2-(4-fluoro-3-methylphenylamino)-6-(4-fluorobenzylamino)-N-hydroxyhexanamide | CHEMBL1760327
Type:
Small organic molecule
Emp. Form.:
C20H25F2N3O2
Mol. Mass.:
377.4282
SMILES:
Cc1cc(N[C@H](CCCCNCc2ccc(F)cc2)C(=O)NO)ccc1F
: