Target
Lethal factor
Ligand
BDBM50340768
Substrate
Meas. Tech.
ChEMBL_740261 (CHEMBL1764161)
Ki
1.2±n/a nM
Citation
 Kim, SJiao, GSMoayeri, MCrown, DCregar-Hernandez, LMcKasson, LMargosiak, SALeppla, SHJohnson, AT Antidotes to anthrax lethal factor intoxication. Part 2: structural modifications leading to improved in vivo efficacy. Bioorg Med Chem Lett 21:2030-3 (2011)  
Target
Name:
Lethal factor
Synonyms:
Anthrax Lethal Factor (LF) Antrax lethal toxin lef | lethal factor
Type:
PROTEIN
Mol. Mass.:
93758.56
Organism:
Bacillus anthracis
Description:
ChEMBL_1460338
Residue:
809
  
Inhibitor
Name:
BDBM50340768
Synonyms:
(R)-2-(4-fluoro-3,5-dimethylphenoxy)-6-(4-fluorobenzylamino)-N-hydroxyhexanamide | CHEMBL1760322
Type:
Small organic molecule
Emp. Form.:
C21H26F2N2O3
Mol. Mass.:
392.4395
SMILES:
Cc1cc(O[C@H](CCCCNCc2ccc(F)cc2)C(=O)NO)cc(C)c1F
: