Target
Epidermal growth factor receptor
Ligand
BDBM3032
Substrate
Meas. Tech.
ChEMBL_739728 (CHEMBL1763554)
IC50
63±n/a nM
Citation
 Garofalo, AGoossens, LSix, PLemoine, ARavez, SFarce, ADepreux, P Impact of aryloxy-linked quinazolines: a novel series of selective VEGFR-2 receptor tyrosine kinase inhibitors. Bioorg Med Chem Lett 21:2106-12 (2011)  
Target
Name:
Epidermal growth factor receptor
Synonyms:
EGF Receptor Substrate EGFR_HUMAN ERBB1 Epidermal Growth Factor Receptor erbB-1 Epidermal growth factor receptor (EGFR) HER1 Proto-oncogene c-ErbB-1 Tyrosine-Protein Kinase ErbB-1
Type:
Receptor Kinase Domain
Mol. Mass.:
134279.59
Organism:
Homo sapiens (Human)
Description:
P00533
Residue:
1210
  
Inhibitor
Name:
BDBM3032
Synonyms:
CHEMBL1204168 N-(3-bromophenyl)-6,7-dimethoxyquinazolin-4-amine US11001595, Compound PD153035 US9422297, PD153035
Type:
Small organic molecule
Emp. Form.:
C16H14BrN3O2
Mol. Mass.:
360.205
SMILES:
COc1cc2ncnc(Nc3cccc(Br)c3)c2cc1OC
: