Target
Neuromedin-K receptor
Ligand
BDBM50341101
Substrate
Meas. Tech.
ChEMBL_740084 (CHEMBL1763144)
IC50
1200±n/a nM
Citation
 Hoveyda, HRRoy, MOBlanc, SNoël, SSalvino, JMAtor, MAFraser, G Discovery of 3-aryl-5-acylpiperazinyl-pyrazoles as antagonists to the NK3 receptor. Bioorg Med Chem Lett 21:1991-6 (2011)  
Target
Name:
Neuromedin-K receptor
Synonyms:
NK-3 receptor NK3R NKR Neurokinin B receptor Neuromedin-3 receptor (NK-3R) Neuromedin-K receptor Neuromedin-K receptor (NK3) TAC3R Tachykinin receptor 3 | Tachykinin receptor 3 (NK3)
Type:
Enzyme
Mol. Mass.:
52221.96
Organism:
Homo sapiens (Human)
Description:
P29371
Residue:
465
  
Inhibitor
Name:
BDBM50341101
Synonyms:
(3-(2-fluorophenyl)-1H-pyrazol-5-yl)(4-(2-methoxyphenyl)piperazin-1-yl)methanone | CHEMBL1760335
Type:
Small organic molecule
Emp. Form.:
C21H21FN4O2
Mol. Mass.:
380.4154
SMILES:
COc1ccccc1N1CCN(CC1)C(=O)c1cc(n[nH]1)-c1ccccc1F
: