Target
Breakpoint cluster region protein/Tyrosine-protein kinase ABL1
Ligand
BDBM50341122
Substrate
Meas. Tech.
ChEMBL_740179 (CHEMBL1763239)
IC50
>10000±n/a nM
Citation
 Wang, DZhang, ZLu, XFeng, YLuo, KGan, JYingxue, LWan, JLi, XZhang, FTu, ZCai, QRen, XDing, K Hybrid compounds as new Bcr/Abl inhibitors. Bioorg Med Chem Lett 21:1965-8 (2011)  
Target
Name:
Breakpoint cluster region protein/Tyrosine-protein kinase ABL1
Synonyms:
Bcr-Abl Breakpoint cluster region protein /Tyrosine-protein kinase ABL | Tyrosine-protein kinase ABL1/Breakpoint cluster region protein
Type:
Enzyme
Mol. Mass.:
Description:
Components:
This complex has 2 components.
Component 1
Name:
Tyrosine-protein kinase ABL1
Synonyms:
ABL ABL1_HUMAN JTK7 Proto-oncogene tyrosine-protein kinase ABL1 Tyrosine-protein kinase ABL V-abl Abelson murine leukemia viral oncogene homolog 1 p150 | tyrosine-protein kinase ABL1 isoform a
Type:
Enzyme
Mol. Mass.:
122897.30
Organism:
Homo sapiens (Human)
Description:
P00519
Residue:
1130
  
Component 2
Name:
Breakpoint cluster region protein
Synonyms:
BCR BCR_HUMAN Breakpoint cluster region protein | D22S11
Type:
PROTEIN
Mol. Mass.:
142824.75
Organism:
Homo sapiens (Human)
Description:
ChEMBL_305348
Residue:
1271
  
Inhibitor
Name:
BDBM50341122
Synonyms:
4-methyl-3-(4-(pyridin-3-yl)thiazol-2-ylamino)-N-(3-(trifluoromethyl)phenyl)benzamide | CHEMBL1760368
Type:
Small organic molecule
Emp. Form.:
C23H17F3N4OS
Mol. Mass.:
454.467
SMILES:
Cc1ccc(cc1Nc1nc(cs1)-c1cccnc1)C(=O)Nc1cccc(c1)C(F)(F)F
: