Target
Breakpoint cluster region protein/Tyrosine-protein kinase ABL1
Ligand
BDBM50341126
Substrate
Meas. Tech.
ChEMBL_740179 (CHEMBL1763239)
IC50
>2000±n/a nM
Citation
 Wang, DZhang, ZLu, XFeng, YLuo, KGan, JYingxue, LWan, JLi, XZhang, FTu, ZCai, QRen, XDing, K Hybrid compounds as new Bcr/Abl inhibitors. Bioorg Med Chem Lett 21:1965-8 (2011)  
Target
Name:
Breakpoint cluster region protein/Tyrosine-protein kinase ABL1
Synonyms:
Bcr-Abl Breakpoint cluster region protein /Tyrosine-protein kinase ABL | Tyrosine-protein kinase ABL1/Breakpoint cluster region protein
Type:
Enzyme
Mol. Mass.:
Description:
Components:
This complex has 2 components.
Component 1
Name:
Tyrosine-protein kinase ABL1
Synonyms:
ABL ABL1_HUMAN JTK7 Proto-oncogene tyrosine-protein kinase ABL1 Tyrosine-protein kinase ABL V-abl Abelson murine leukemia viral oncogene homolog 1 p150 | tyrosine-protein kinase ABL1 isoform a
Type:
Enzyme
Mol. Mass.:
122897.30
Organism:
Homo sapiens (Human)
Description:
P00519
Residue:
1130
  
Component 2
Name:
Breakpoint cluster region protein
Synonyms:
BCR BCR_HUMAN Breakpoint cluster region protein | D22S11
Type:
PROTEIN
Mol. Mass.:
142824.75
Organism:
Homo sapiens (Human)
Description:
ChEMBL_305348
Residue:
1271
  
Inhibitor
Name:
BDBM50341126
Synonyms:
CHEMBL1760372 | N-[3-Adamantan-1-yl-5-(4-methyl-imidazol-1-yl)-phenyl]-4-methyl-3-(4-pyridin-3-yl-thiazol-2-ylamino)-benzamide
Type:
Small organic molecule
Emp. Form.:
C36H36N6OS
Mol. Mass.:
600.776
SMILES:
Cc1cn(cn1)-c1cc(NC(=O)c2ccc(C)c(Nc3nc(cs3)-c3cccnc3)c2)cc(c1)C12CC3CC(CC(C3)C1)C2
: