Target
Amine oxidase [flavin-containing] A
Ligand
BDBM50341154
Substrate
Meas. Tech.
ChEMBL_740466 (CHEMBL1764621)
Ki
281.19±n/a nM
Citation
 Mishra, NSasmal, D Development of selective and reversible pyrazoline based MAO-B inhibitors: virtual screening, synthesis and biological evaluation. Bioorg Med Chem Lett 21:1969-73 (2011)  
Target
Name:
Amine oxidase [flavin-containing] A
Synonyms:
AOFA_HUMAN MAO-A Monoamine oxidase Monoamine oxidase type A (MAO A) Monoamine oxidase type A (MAOA)
Type:
Protein
Mol. Mass.:
59689.53
Organism:
Homo sapiens (Human)
Description:
P21397
Residue:
527
  
Inhibitor
Name:
BDBM50341154
Synonyms:
3-(anthracen-9-yl)-5-(4-chlorophenyl)-4,5-dihydro-1H-pyrazole | CHEMBL1760715
Type:
Small organic molecule
Emp. Form.:
C23H17ClN2
Mol. Mass.:
356.847
SMILES:
Clc1ccc(cc1)C1CC(N=N1)c1c2ccccc2cc2ccccc12
: