Target
Amine oxidase [flavin-containing] B
Ligand
BDBM50341152
Substrate
Meas. Tech.
ChEMBL_740468 (CHEMBL1764623)
Ki
1.15±n/a nM
Citation
 Mishra, NSasmal, D Development of selective and reversible pyrazoline based MAO-B inhibitors: virtual screening, synthesis and biological evaluation. Bioorg Med Chem Lett 21:1969-73 (2011)  
Target
Name:
Amine oxidase [flavin-containing] B
Synonyms:
AOFB_HUMAN MAOB Monoamine oxidase type B (MAO B) Monoamine oxidase type B (MAOB)
Type:
Protein
Mol. Mass.:
58768.76
Organism:
Homo sapiens (Human)
Description:
P27338
Residue:
520
  
Inhibitor
Name:
BDBM50341152
Synonyms:
3-(anthracen-9-yl)-5-(4-nitrophenyl)-4,5-dihydro-1H-pyrazole | CHEMBL1760713
Type:
Small organic molecule
Emp. Form.:
C23H17N3O2
Mol. Mass.:
367.4
SMILES:
[O-][N+](=O)c1ccc(cc1)C1CC(N=N1)c1c2ccccc2cc2ccccc12
: