Target
Adenosine receptor A2a
Ligand
BDBM50321524
Substrate
Meas. Tech.
ChEMBL_740588 (CHEMBL1764851)
Ki
250±n/a nM
Citation
 Firooznia, FCheung, AWBrinkman, JGrimsby, JGubler, MLHamid, RMarcopulos, NRamsey, GTan, JWen, YSarabu, R Discovery of benzothiazole-based adenosine A2B receptor antagonists with improved A2A selectivity. Bioorg Med Chem Lett 21:1933-6 (2011)  
Target
Name:
Adenosine receptor A2a
Synonyms:
A2A adenosine receptor (hA2A) ADENOSINE A2 ADORA2 Adenosine A2A receptor (A2AAR)
Type:
G Protein-Coupled Receptor (GPCR)
Mol. Mass.:
44716.46
Organism:
Homo sapiens (Human)
Description:
P29274
Residue:
412
  
Inhibitor
Name:
BDBM50321524
Synonyms:
CHEMBL1170518 | N-(7-acetamido-4-methoxybenzo[d]thiazol-2-yl)-4-fluorobenzamide
Type:
Small organic molecule
Emp. Form.:
C17H14FN3O3S
Mol. Mass.:
359.375
SMILES:
COc1ccc(NC(C)=O)c2sc(NC(=O)c3ccc(F)cc3)nc12
: