Target
Adenosine receptor A2a
Ligand
BDBM50341198
Substrate
Meas. Tech.
ChEMBL_740588 (CHEMBL1764851)
Ki
530±n/a nM
Citation
 Firooznia, FCheung, AWBrinkman, JGrimsby, JGubler, MLHamid, RMarcopulos, NRamsey, GTan, JWen, YSarabu, R Discovery of benzothiazole-based adenosine A2B receptor antagonists with improved A2A selectivity. Bioorg Med Chem Lett 21:1933-6 (2011)  
Target
Name:
Adenosine receptor A2a
Synonyms:
A2A adenosine receptor (hA2A) ADENOSINE A2 ADORA2 Adenosine A2A receptor (A2AAR)
Type:
G Protein-Coupled Receptor (GPCR)
Mol. Mass.:
44716.46
Organism:
Homo sapiens (Human)
Description:
P29274
Residue:
412
  
Inhibitor
Name:
BDBM50341198
Synonyms:
CHEMBL1760901 | N-(7-(N-ethylacetamido)-4-methoxybenzo[d]thiazol-2-yl)-4-(3-(trifluoromethyl)phenylsulfonyl)piperidine-1-carboxamide
Type:
Small organic molecule
Emp. Form.:
C25H27F3N4O5S2
Mol. Mass.:
584.631
SMILES:
CCN(C(C)=O)c1ccc(OC)c2nc(NC(=O)N3CCC(CC3)S(=O)(=O)c3cccc(c3)C(F)(F)F)sc12
: