Target
Serine/threonine-protein kinase mTOR
Ligand
BDBM50341211
Substrate
Meas. Tech.
ChEMBL_741994 (CHEMBL1768754)
EC50
1±n/a nM
Citation
 Liu, QWang, JKang, SAThoreen, CCHur, WAhmed, TSabatini, DMGray, NS Discovery of 9-(6-aminopyridin-3-yl)-1-(3-(trifluoromethyl)phenyl)benzo[h][1,6]naphthyridin-2(1H)-one (Torin2) as a potent, selective, and orally available mammalian target of rapamycin (mTOR) inhibitor for treatment of cancer. J Med Chem 54:1473-80 (2011)  
Target
Name:
Serine/threonine-protein kinase mTOR
Synonyms:
FK506-binding protein 12-rapamycin complex-associated protein 1 Frap MTOR_MOUSE Mechanistic target of rapamycin RAPT1 Serine/threonine-protein kinase mTOR | Serine/threonine-protein kinase mTOR (mTOR)
Type:
Enzyme
Mol. Mass.:
288814.44
Organism:
Mus musculus (Mouse)
Description:
Q9JLN9
Residue:
2549
  
Inhibitor
Name:
BDBM50341211
Synonyms:
9-(2-aminopyrimidin-5-yl)-1-(4-fluoro-3-(trifluoromethyl)phenyl)benzo[h][1,6]naphthyridin-2(1H)-one | CHEMBL1765606
Type:
Small organic molecule
Emp. Form.:
C23H13F4N5O
Mol. Mass.:
451.3758
SMILES:
Nc1ncc(cn1)-c1ccc2ncc3ccc(=O)n(-c4ccc(F)c(c4)C(F)(F)F)c3c2c1
: