Target
Serine/threonine-protein kinase mTOR
Ligand
BDBM50341223
Substrate
Meas. Tech.
ChEMBL_741994 (CHEMBL1768754)
EC50
20±n/a nM
Citation
 Liu, QWang, JKang, SAThoreen, CCHur, WAhmed, TSabatini, DMGray, NS Discovery of 9-(6-aminopyridin-3-yl)-1-(3-(trifluoromethyl)phenyl)benzo[h][1,6]naphthyridin-2(1H)-one (Torin2) as a potent, selective, and orally available mammalian target of rapamycin (mTOR) inhibitor for treatment of cancer. J Med Chem 54:1473-80 (2011)  
Target
Name:
Serine/threonine-protein kinase mTOR
Synonyms:
FK506-binding protein 12-rapamycin complex-associated protein 1 Frap MTOR_MOUSE Mechanistic target of rapamycin RAPT1 Serine/threonine-protein kinase mTOR | Serine/threonine-protein kinase mTOR (mTOR)
Type:
Enzyme
Mol. Mass.:
288814.44
Organism:
Mus musculus (Mouse)
Description:
Q9JLN9
Residue:
2549
  
Inhibitor
Name:
BDBM50341223
Synonyms:
1-(4-fluoro-3-methylphenyl)-9-(6-methoxypyridin-3-yl)benzo[h][1,6]naphthyridin-2(1H)-one | CHEMBL1765612
Type:
Small organic molecule
Emp. Form.:
C25H18FN3O2
Mol. Mass.:
411.4277
SMILES:
COc1ccc(cn1)-c1ccc2ncc3ccc(=O)n(-c4ccc(F)c(C)c4)c3c2c1
: