Target
Glucose-dependent insulinotropic receptor
Ligand
BDBM50341312
Substrate
Meas. Tech.
ChEMBL_742671 (CHEMBL1769549)
Ki
1176±n/a nM
Citation
 McClure, KFDarout, EGuimarães, CRDeNinno, MPMascitti, VMunchhof, MJRobinson, RPKohrt, JHarris, ARMoore, DELi, BSamp, LLefker, BAFutatsugi, KKung, DBonin, PDCornelius, PWang, RSalter, EHornby, SKalgutkar, ASChen, Y Activation of the G-protein-coupled receptor 119: a conformation-based hypothesis for understanding agonist response. J Med Chem 54:1948-52 (2011)  
Target
Name:
Glucose-dependent insulinotropic receptor
Synonyms:
G-protein coupled receptor 119 (GPR119) GPR119 | Glucose-dependent insulinotropic receptor
Type:
Protein
Mol. Mass.:
36901.49
Organism:
Homo sapiens (Human)
Description:
Q8TDV5
Residue:
335
  
Inhibitor
Name:
BDBM50341312
Synonyms:
(1R,5R,8R)-Isopropyl 8-(5-Methyl-6-(2-methylpyridin-3-yloxy)pyrimidin-4-yloxy)-6-oxa-3-azabicyclo[3.2.1]octane-3-carboxylate | CHEMBL1766202
Type:
Small organic molecule
Emp. Form.:
C21H26N4O5
Mol. Mass.:
414.4549
SMILES:
CC(C)OC(=O)N1C[C@@H]2CO[C@H](C1)[C@@H]2Oc1ncnc(Oc2cccnc2C)c1C
: