Target
Glucose-dependent insulinotropic receptor
Ligand
BDBM50341310
Substrate
Meas. Tech.
ChEMBL_742671 (CHEMBL1769549)
Ki
33.0±n/a nM
Citation
 McClure, KFDarout, EGuimarães, CRDeNinno, MPMascitti, VMunchhof, MJRobinson, RPKohrt, JHarris, ARMoore, DELi, BSamp, LLefker, BAFutatsugi, KKung, DBonin, PDCornelius, PWang, RSalter, EHornby, SKalgutkar, ASChen, Y Activation of the G-protein-coupled receptor 119: a conformation-based hypothesis for understanding agonist response. J Med Chem 54:1948-52 (2011)  
Target
Name:
Glucose-dependent insulinotropic receptor
Synonyms:
G-protein coupled receptor 119 (GPR119) GPR119 | Glucose-dependent insulinotropic receptor
Type:
Protein
Mol. Mass.:
36901.49
Organism:
Homo sapiens (Human)
Description:
Q8TDV5
Residue:
335
  
Inhibitor
Name:
BDBM50341310
Synonyms:
CHEMBL1766082 Isopropyl 9-syn-({5-Methyl-6-[(2-methylpyridin-3-yl)oxy]-pyrimidin-4-yl}oxy)-3-oxa-7-azabicyclo[3.3.1]nonane-7-carboxylate
Type:
Small organic molecule
Emp. Form.:
C22H28N4O5
Mol. Mass.:
428.4815
SMILES:
CC(C)OC(=O)N1CC2COCC(C1)C2Oc1ncnc(Oc2cccnc2C)c1C
: