Target
Mitogen-activated protein kinase 14
Ligand
BDBM50314070
Substrate
Meas. Tech.
ChEMBL_742454 (CHEMBL1769102)
IC50
14±n/a nM
Citation
 Goldstein, DMSoth, MGabriel, TDewdney, NKuglstatter, AArzeno, HChen, JBingenheimer, WDalrymple, SADunn, JFarrell, RFrauchiger, SLa Fargue, JGhate, MGraves, BHill, RJLi, FLitman, RLoe, BMcIntosh, JMcWeeney, DPapp, EPark, JReese, HFRoberts, RTRotstein, DSan Pablo, BSarma, KStahl, MSung, MLSuttman, RTSjogren, EBTan, YTrejo, AWelch, MWeller, PWong, BRZecic, H Discovery of 6-(2,4-difluorophenoxy)-2-[3-hydroxy-1-(2-hydroxyethyl)propylamino]-8-methyl-8H-pyrido[2,3-d]pyrimidin-7-one (pamapimod) and 6-(2,4-difluorophenoxy)-8-methyl-2-(tetrahydro-2H-pyran-4-ylamino)pyrido[2,3-d]pyrimidin-7(8H)-one (R1487) as orally bioavailable and highly selective inhibitors J Med Chem 54:2255-65 (2011)  
Target
Name:
Mitogen-activated protein kinase 14
Synonyms:
CSAID-binding protein CSBP1 CSPB1 MAP kinase 14 MAP kinase p38 alpha MAPK14 MK14_HUMAN Mitogen-activated protein kinase p38 alpha Stress-activated protein kinase 2a | p38 MAP kinase alpha/beta
Type:
Serine/threonine-protein kinase
Mol. Mass.:
41286.76
Organism:
Homo sapiens (Human)
Description:
Q16539
Residue:
360
  
Inhibitor
Name:
BDBM50314070
Synonyms:
6-(2,4-difluorophenoxy)-2-{[3-hydroxy-1-(2-hydroxyethyl)propyl]amino}-8-methylpyrido[2,3-d]pyrimidin-7(8H)-one pamapimod
Type:
Small organic molecule
Emp. Form.:
C19H20F2N4O4
Mol. Mass.:
406.3833
SMILES:
Cn1c2nc(NC(CCO)CCO)ncc2cc(Oc2ccc(F)cc2F)c1=O
: