Target
Tyrosine-protein kinase ITK/TSK
Ligand
BDBM50341521
Substrate
Meas. Tech.
ChEMBL_741887 (CHEMBL1768448)
Ki
7±n/a nM
Citation
 Charrier, JDMiller, AKay, DPBrenchley, GTwin, HCCollier, PNRamaya, SKeily, SBDurrant, SJKnegtel, RMTanner, AJBrown, KCurnock, APJimenez, JM Discovery and structure-activity relationship of 3-aminopyrid-2-ones as potent and selective interleukin-2 inducible T-cell kinase (Itk) inhibitors. J Med Chem 54:2341-50 (2011)  
Target
Name:
Tyrosine-protein kinase ITK/TSK
Synonyms:
EMT ITK_HUMAN LYK Tyrosine-protein kinase ITK Tyrosine-protein kinase Lyk
Type:
Protein
Mol. Mass.:
71839.20
Organism:
Homo sapiens (Human)
Description:
Q08881
Residue:
620
  
Inhibitor
Name:
BDBM50341521
Synonyms:
3-(4-(Piperidin-1-yl)benzoylamino)-5-(2-(methylamino)pyridin-4-yl)-(1H)-pyridin-2-one | CHEMBL1765774
Type:
Small organic molecule
Emp. Form.:
C23H25N5O2
Mol. Mass.:
403.4769
SMILES:
CNc1cc(ccn1)-c1c[nH]c(=O)c(NC(=O)c2ccc(cc2)N2CCCCC2)c1
: