Target
Receptor-type tyrosine-protein kinase FLT3
Ligand
BDBM50341540
Substrate
Meas. Tech.
ChEMBL_742046 (CHEMBL1768909)
Ki
11±n/a nM
Citation
 Charrier, JDMiller, AKay, DPBrenchley, GTwin, HCCollier, PNRamaya, SKeily, SBDurrant, SJKnegtel, RMTanner, AJBrown, KCurnock, APJimenez, JM Discovery and structure-activity relationship of 3-aminopyrid-2-ones as potent and selective interleukin-2 inducible T-cell kinase (Itk) inhibitors. J Med Chem 54:2341-50 (2011)  
Target
Name:
Receptor-type tyrosine-protein kinase FLT3
Synonyms:
CD135 FL cytokine receptor FLK2 FLT3 Fetal liver kinase-2 Fms-like tyrosine kinase 3 (Flt-3) STK-1 Stem cell tyrosine kinase 1
Type:
Enzyme
Mol. Mass.:
112888.62
Organism:
Homo sapiens (Human)
Description:
P36888
Residue:
993
  
Inhibitor
Name:
BDBM50341540
Synonyms:
3-(4-tert-Butylbenzoylamino)-5-(pyridin-4-yl)-(1H)-pyridin-2-one | CHEMBL1765770
Type:
Small organic molecule
Emp. Form.:
C21H21N3O2
Mol. Mass.:
347.4103
SMILES:
CC(C)(C)c1ccc(cc1)C(=O)Nc1cc(c[nH]c1=O)-c1ccncc1
: