Target
Steroidogenic factor 1
Ligand
BDBM50418314
Substrate
Meas. Tech.
ChEMBL_743680 (CHEMBL1767449)
EC50
158.49±n/a nM
Citation
 Whitby, RJStec, JBlind, RDDixon, SLeesnitzer, LMOrband-Miller, LAWilliams, SPWillson, TMXu, RZuercher, WJCai, FIngraham, HA Small molecule agonists of the orphan nuclear receptors steroidogenic factor-1 (SF-1, NR5A1) and liver receptor homologue-1 (LRH-1, NR5A2). J Med Chem 54:2266-81 (2011)  
Target
Name:
Steroidogenic factor 1
Synonyms:
AD4BP FTZF1 NR5A1 SF-1 STF-1 Steroid hormone receptor Ad4BP
Type:
Nuclear Hormone Receptor
Mol. Mass.:
51643.43
Organism:
Homo sapiens (Human)
Description:
Residue:
461
  
Inhibitor
Name:
BDBM50418314
Synonyms:
CHEMBL1765954
Type:
Small organic molecule
Emp. Form.:
C30H38
Mol. Mass.:
398.6227
SMILES:
CCCCCCCCC1=C(c2ccccc2)[C@@]2(CCC[C@@H]2C1)C(=C)c1ccccc1
: