Target
Nitric oxide synthase, brain
Ligand
BDBM50341683
Substrate
Meas. Tech.
ChEMBL_743326 (CHEMBL1767573)
Ki
38±n/a nM
Citation
 Xue, FFang, JDelker, SLLi, HMartásek, PRoman, LJPoulos, TLSilverman, RB Symmetric double-headed aminopyridines, a novel strategy for potent and membrane-permeable inhibitors of neuronal nitric oxide synthase. J Med Chem 54:2039-48 (2011)  
Target
Name:
Nitric oxide synthase, brain
Synonyms:
Bnos NC-NOS NOS type I nNOS Neuronal nitric oxide synthase Nitric Oxide Synthase, brain Nitric oxide synthase, brain (nNOS) Nitric-oxide synthase, brain (nNOS) Nos1 | Peptidyl-cysteine S-nitrosylase NOS1
Type:
Enzyme
Mol. Mass.:
160570.98
Organism:
Rattus norvegicus (rat)
Description:
Recombinant nNOS overexpressed in E. coli was used in enzyme assays.
Residue:
1429
  
Inhibitor
Name:
BDBM50341683
Synonyms:
4-(3-(2-(6-Amino-4-methylpyridin-2-yl)ethyl)phenethyl)-6-methylpyridin-2-amine CHEMBL1615287
Type:
Small organic molecule
Emp. Form.:
C22H26N4
Mol. Mass.:
346.4686
SMILES:
Cc1cc(N)nc(CCc2cccc(CCc3cc(C)nc(N)c3)c2)c1
: