Target
Nitric oxide synthase, endothelial
Ligand
BDBM50330882
Substrate
Meas. Tech.
ChEMBL_743324 (CHEMBL1767571)
Ki
20000±n/a nM
Citation
 Xue, FFang, JDelker, SLLi, HMartásek, PRoman, LJPoulos, TLSilverman, RB Symmetric double-headed aminopyridines, a novel strategy for potent and membrane-permeable inhibitors of neuronal nitric oxide synthase. J Med Chem 54:2039-48 (2011)  
Target
Name:
Nitric oxide synthase, endothelial
Synonyms:
Constitutive NOS Endothelial NOS NOS type III NOS3_HUMAN Nitric oxide synthase (inducible and endothelial) Nitric-oxide synthase (endothelial and brain) eNOS
Type:
Enzyme Catalytic Domain
Mol. Mass.:
133297.84
Organism:
Homo sapiens (Human)
Description:
P29474
Residue:
1203
  
Inhibitor
Name:
BDBM50330882
Synonyms:
CHEMBL1277951 N1-((3R,4R)-4-((6-aminopyridin-2-yl)methyl)pyrrolidin-3-yl)-N2-(4-fluorobenzyl)ethane-1,2-diamine tetrahydrochloride US9212144, 1 | US9783500, Compound 2
Type:
Small organic molecule
Emp. Form.:
C21H30FN5
Mol. Mass.:
371.4948
SMILES:
Cc1cc(N)nc(C[C@@H]2CNC[C@@H]2NCCNCCc2cccc(F)c2)c1
: