Target
Nitric oxide synthase, brain
Ligand
BDBM50255365
Substrate
Meas. Tech.
ChEMBL_743332 (CHEMBL1767579)
IC50
>10000±n/a nM
Citation
 Xue, FFang, JDelker, SLLi, HMartásek, PRoman, LJPoulos, TLSilverman, RB Symmetric double-headed aminopyridines, a novel strategy for potent and membrane-permeable inhibitors of neuronal nitric oxide synthase. J Med Chem 54:2039-48 (2011)  
Target
Name:
Nitric oxide synthase, brain
Synonyms:
Constitutive NOS NC-NOS NOS type I nNOS NOS1_HUMAN Neuronal nitric oxide synthase Nitric oxide synthase, neuronal (nNOS) bNOS | nNOS
Type:
Homodimer
Mol. Mass.:
160985.98
Organism:
Homo sapiens (Human)
Description:
P29475
Residue:
1434
  
Inhibitor
Name:
BDBM50255365
Synonyms:
(+/-)-cis-N1-((3S,4S)-4-((6-amino-4-methylpyridin-2-yl)methyl)pyrrolidin-3-yl)-N2-(3-fluorophenethyl)ethane-1,2-diamine CHEMBL480419 N1-{(+/-)-4''-[(6''''-amino-4''''-methylpyridin-2''''-yl)methyl]pyrrolidin-3-yl}-N2-(3''-fluorophenethyl)ethane-1,2-diamine
Type:
Small organic molecule
Emp. Form.:
C21H30FN5
Mol. Mass.:
371.4948
SMILES:
Cc1cc(N)nc(C[C@H]2CNC[C@H]2NCCNCCc2cccc(F)c2)c1
: