Target
Serine/threonine-protein kinase ATR
Ligand
BDBM50341751
Substrate
Meas. Tech.
ChEMBL_743396 (CHEMBL1767695)
Ki
6±n/a nM
Citation
 Charrier, JDDurrant, SJGolec, JMKay, DPKnegtel, RMMacCormick, SMortimore, MO'Donnell, MEPinder, JLReaper, PMRutherford, APWang, PSYoung, SCPollard, JR Discovery of potent and selective inhibitors of ataxia telangiectasia mutated and Rad3 related (ATR) protein kinase as potential anticancer agents. J Med Chem 54:2320-30 (2011)  
Target
Name:
Serine/threonine-protein kinase ATR
Synonyms:
ATR Ataxia telangiectasia and Rad3-related protein (ATR) FRP1 | Serine-protein kinase ATR
Type:
Protein
Mol. Mass.:
301404.58
Organism:
Homo sapiens (Human)
Description:
Q13535
Residue:
2644
  
Inhibitor
Name:
BDBM50341751
Synonyms:
3-amino-6-(4-((1-(dimethylamino)propan-2-yl)sulfonyl)-phenyl)-N-phenylpyrazine-2-carboxamide | CHEMBL1766797
Type:
Small organic molecule
Emp. Form.:
C22H25N5O3S
Mol. Mass.:
439.531
SMILES:
CC(CN(C)C)S(=O)(=O)c1ccc(cc1)-c1cnc(N)c(n1)C(=O)Nc1ccccc1
: