Target
Serine-protein kinase ATM
Ligand
BDBM50341717
Substrate
Meas. Tech.
ChEMBL_743383 (CHEMBL1767682)
IC50
>8000±n/a nM
Citation
 Charrier, JDDurrant, SJGolec, JMKay, DPKnegtel, RMMacCormick, SMortimore, MO'Donnell, MEPinder, JLReaper, PMRutherford, APWang, PSYoung, SCPollard, JR Discovery of potent and selective inhibitors of ataxia telangiectasia mutated and Rad3 related (ATR) protein kinase as potential anticancer agents. J Med Chem 54:2320-30 (2011)  
Target
Name:
Serine-protein kinase ATM
Synonyms:
A-T mutated ATM_HUMAN | Ataxia telangiectasia mutated
Type:
Protein
Mol. Mass.:
350696.72
Organism:
Homo sapiens (Human)
Description:
Q13315
Residue:
3056
  
Inhibitor
Name:
BDBM50341717
Synonyms:
3-Amino-6-(cyclohex-1-en-1-yl)-N-phenylpyrazine-2-carboxamide | CHEMBL1766763
Type:
Small organic molecule
Emp. Form.:
C17H18N4O
Mol. Mass.:
294.351
SMILES:
Nc1ncc(nc1C(=O)Nc1ccccc1)C1=CCCCC1
: