Target
Serine-protein kinase ATM
Ligand
BDBM50341758
Substrate
Meas. Tech.
ChEMBL_743383 (CHEMBL1767682)
IC50
120±n/a nM
Citation
 Charrier, JDDurrant, SJGolec, JMKay, DPKnegtel, RMMacCormick, SMortimore, MO'Donnell, MEPinder, JLReaper, PMRutherford, APWang, PSYoung, SCPollard, JR Discovery of potent and selective inhibitors of ataxia telangiectasia mutated and Rad3 related (ATR) protein kinase as potential anticancer agents. J Med Chem 54:2320-30 (2011)  
Target
Name:
Serine-protein kinase ATM
Synonyms:
A-T mutated ATM_HUMAN | Ataxia telangiectasia mutated
Type:
Protein
Mol. Mass.:
350696.72
Organism:
Homo sapiens (Human)
Description:
Q13315
Residue:
3056
  
Inhibitor
Name:
BDBM50341758
Synonyms:
3-(1H-indol-2-yl)-5-(4-(methylsulfonyl)phenyl)pyrazin-2-amine | CHEMBL1766804
Type:
Small organic molecule
Emp. Form.:
C19H16N4O2S
Mol. Mass.:
364.421
SMILES:
CS(=O)(=O)c1ccc(cc1)-c1cnc(N)c(n1)-c1cc2ccccc2[nH]1
: