Target
A disintegrin and metalloproteinase with thrombospondin motifs 4
Ligand
BDBM50104963
Substrate
Meas. Tech.
ChEMBL_743599 (CHEMBL1768099)
IC50
3±n/a nM
Citation
 Shiozaki, MMaeda, KMiura, TKotoku, MYamasaki, TMatsuda, IAoki, KYasue, KImai, HUbukata, MSuma, AYokota, MHotta, TTanaka, MHase, YHaas, JFryer, AMLaird, ERLittmann, NMAndrews, SWJosey, JAMimura, TShinozaki, YYoshiuchi, HInaba, T Discovery of (1S,2R,3R)-2,3-dimethyl-2-phenyl-1-sulfamidocyclopropanecarboxylates: novel and highly selective aggrecanase inhibitors. J Med Chem 54:2839-63 (2011)  
Target
Name:
A disintegrin and metalloproteinase with thrombospondin motifs 4
Synonyms:
A disintegrin and metalloproteinase with thrombospondin motifs 4 (ADAMTS-4) ATS4_HUMAN KIAA0688 | Metalloproteinase with thrombospondin motifs 4 (ADAMTS-4)
Type:
Enzyme
Mol. Mass.:
90214.54
Organism:
Homo sapiens (Human)
Description:
O75173
Residue:
837
  
Inhibitor
Name:
BDBM50104963
Synonyms:
(2S,3R)-2-(cyclopropylmethylamino)-N1-hydroxy-N4-((1S,2R)-2-hydroxy-2,3-dihydro-1H-inden-1-yl)-3-(3-hydroxybenzyl)succinamide (R)-2-(Cyclopropylmethyl-amino)-N*1*-hydroxy-3-(3-hydroxy-benzyl)-N*4*-((3S,3aR)-2-hydroxy-indan-1-yl)-succinamide CHEMBL24398
Type:
Small organic molecule
Emp. Form.:
C24H29N3O5
Mol. Mass.:
439.5042
SMILES:
ONC(=O)[C@@H](NCC1CC1)[C@@H](Cc1cccc(O)c1)C(=O)N[C@@H]1[C@H](O)Cc2ccccc12
: