Target
Histone deacetylase 5
Ligand
BDBM19149
Substrate
Meas. Tech.
ChEMBL_743701 (CHEMBL1767470)
IC50
150±n/a nM
Citation
 Botta, CBCabri, WCini, EDe Cesare, LFattorusso, CGiannini, GPersico, MPetrella, ARondinelli, FRodriquez, MRusso, ATaddei, M Oxime amides as a novel zinc binding group in histone deacetylase inhibitors: synthesis, biological activity, and computational evaluation. J Med Chem 54:2165-82 (2011)  
Target
Name:
Histone deacetylase 5
Synonyms:
Antigen NY-CO-9 HDAC5 Histone acetylase 5 (HDAC5) Human HDAC5 | KIAA0600
Type:
Enzyme
Mol. Mass.:
121968.61
Organism:
Homo sapiens (Human)
Description:
Q9UQL6
Residue:
1122
  
Inhibitor
Name:
BDBM19149
Synonyms:
CHEMBL98 SAHA US10188756, Compound SAHA US11505523, Compound SAHA US9353061, SAHA US9695181, Vorinostat Zolinza suberoylanilide hydroxamic acid
Type:
Small organic molecule
Emp. Form.:
C14H20N2O3
Mol. Mass.:
264.3202
SMILES:
ONC(=O)CCCCCCC(=O)Nc1ccccc1
: