Target
Lysosomal alpha-glucosidase
Ligand
BDBM50341975
Substrate
Meas. Tech.
ChEMBL_743502 (CHEMBL1767943)
IC50
>236000±n/a nM
Citation
 Xie, WTanabe, GMatsuoka, KAmer, MFMinematsu, TWu, XYoshikawa, MMuraoka, O Role of the side chain stereochemistry in thea-glucosidase inhibitory activity of kotalanol, a potent naturala-glucosidase inhibitor. Bioorg Med Chem 19:2252-62 (2011)  
Target
Name:
Lysosomal alpha-glucosidase
Synonyms:
Acidic alpha-glucosidase LYAG_RAT
Type:
PROTEIN
Mol. Mass.:
106191.24
Organism:
Rattus norvegicus
Description:
ChEMBL_1506157
Residue:
953
  
Inhibitor
Name:
BDBM50341975
Synonyms:
1,4-dideoxy-1,4-{(S)-[(2S,3R,4S,5R,6R)-2,4,5,6,7-pentahydroxy-3-(sulfooxy)heptyl]episulfoniumylidene}-D-arabinitol inner salt | CHEMBL1765344
Type:
Small organic molecule
Emp. Form.:
C12H24O12S2
Mol. Mass.:
424.442
SMILES:
OC[C@@H](O)[C@@H](O)[C@H](O)[C@@H](OS([O-])(=O)=O)[C@H](O)C[S+]1C[C@@H](O)[C@H](O)[C@H]1CO
: