Target
Sucrase-isomaltase, intestinal
Ligand
BDBM50341973
Substrate
Meas. Tech.
ChEMBL_743500 (CHEMBL1767941)
IC50
>236000±n/a nM
Citation
 Xie, WTanabe, GMatsuoka, KAmer, MFMinematsu, TWu, XYoshikawa, MMuraoka, O Role of the side chain stereochemistry in thea-glucosidase inhibitory activity of kotalanol, a potent naturala-glucosidase inhibitor. Bioorg Med Chem 19:2252-62 (2011)  
Target
Name:
Sucrase-isomaltase, intestinal
Synonyms:
SUIS_RAT Sucrase-isomaltase | alpha-Glucosidase (α-Glucosidase)
Type:
Enzyme
Mol. Mass.:
210329.04
Organism:
Rattus norvegicus (Rat)
Description:
P23739
Residue:
1841
  
Inhibitor
Name:
BDBM50341973
Synonyms:
1,4-dideoxy-1,4-{(S)-[(2S,3R,4S,5R,6S)-2,4,5,6,7-pentahydroxy-3-(sulfooxy)heptyl]episulfoniumylidene}-D-arabinitol inner salt | CHEMBL1765290
Type:
Small organic molecule
Emp. Form.:
C12H24O12S2
Mol. Mass.:
424.442
SMILES:
OC[C@H](O)[C@@H](O)[C@H](O)[C@@H](OS([O-])(=O)=O)[C@H](O)C[S+]1C[C@@H](O)[C@H](O)[C@H]1CO
: